{"text_format":"1","workbook":"xlsx","n_sheets":8,"sheets":["Summary","Valuation Method","Participant Awards","Participant Values","Company Perspective","Variables","Calcs","Rate Table"],"not_rendered":{"charts":4,"images":2,"macros":1,"external_links":10,"defined_names":177,"comments":2,"pivot_tables":0},"unopened":[],"bounds":{"document_bytes":16777216,"sheet_cells":100000,"rows_first":2000,"rows_last":500,"rows_between":2000,"halvings":0,"cell_chars":16384,"cell_head_chars":4096},"cells_cut":0,"cells_raw":0,"read":"whole","date_system":"1900"}

{"sheet":"Summary","index":0,"n_rows":81,"n_cols":35,"rows_kept":81,"cut":false,"hidden":false,"merged":[[7,1,8,55],[5,0,5,56],[10,1,10,10],[11,3,11,54],[75,3,75,54],[74,1,74,10],[15,1,15,10],[16,3,16,54],[12,3,12,54],[13,3,13,54],[70,3,72,54],[22,1,22,12],[38,5,39,54],[47,1,47,10],[64,5,64,54],[69,1,69,10]]}
[]
[]
[]
[]
[]
["The Phantom Stock Plan Modeler - Executive Benefit Solutions"]
[]
[null,"Phantom stock plans are a form of a Deferred Compensation and does not represent equity ownership in the Company. Phantom stock plans may be subject to either ERISA and/or IRC Section 409A depending upon the structure of the plan. Companies should seek guidance from qualified advisors if they wish to avoid these regulations"]
[]
[]
{"$rows_left_out":72}
{"sheet":"Valuation Method","index":1,"n_rows":24,"n_cols":23,"rows_kept":24,"cut":false,"hidden":false,"merged":[[20,7,20,8],[15,2,15,6],[17,7,17,8],[15,7,15,8],[5,7,5,8],[16,7,16,8],[21,7,21,8],[22,7,22,8],[4,2,4,8],[9,2,9,6],[9,7,9,8],[10,7,10,8],[21,2,21,6],[12,2,12,8],[6,7,6,8],[8,7,8,8],[7,7,7,8],[13,7,13,8],[14,7,14,8],[19,2,19,8]]}
[]
[]
[]
[]
[null,null,"PROJECTED BUSINESS VALUE - Specied or Formula Based"]
[null,null,"Base line year for measurement period to begin",null,null,null,null,2015]
[null,null,"How many future years do you want to model (3-10)?",null,null,null,null,10]
[null,null,"How many total shares are there?",null,null,null,null,100000]
[null,null,"What % of future value are you willing to give to Execs?",null,null,null,null,0.2]
[null,null,"Specify Business Value or use a Formula based Approach",null,null,null,null,"Formula Based"]
{"$rows_left_out":15}
{"sheet":"Participant Awards","index":2,"n_rows":22,"n_cols":19,"rows_kept":22,"cut":false,"hidden":false,"merged":[[21,3,21,7],[7,2,7,7],[7,9,7,18]]}
[]
[]
[]
[]
[]
[]
[]
[null,null,"Enter the List of Executives who will Participate in the Plan",null,null,null,null,null,null,"Enter the % of the Pool to be Awarded to Each Participant"]
[null,null,null,null,null,"1st Year",null,"% Target",null,1,{"$f":"J9+1","v":2},{"$f":"K9+1","v":3},4,5,6,7,8,9,10]
[null,null,"#"," Name"," Title","Eligible","Salary","Bonus",null,{"$f":"'Valuation Method'!H6+1","v":2016},{"$f":"J10+1","v":2017},{"$f":"K10+1","v":2018},{"$f":"L10+1","v":2019},2020,{"$f":"N10+1","v":2021},2022,2023,2024,2025]
{"$rows_left_out":13}
{"sheet":"Participant Values","index":3,"n_rows":274,"n_cols":46,"rows_kept":274,"cut":false,"hidden":false,"merged":[[7,3,7,4]]}
[]
[]
[]
[]
[null,null,null,"Go to the Yellow Box and select which Executive's results to view"]
[]
[]
[null,null,{"$f":"Variables!$X$30","v":1},"John Smith",null,"Phantom\nStock","Phantom\nShares","Share"]
[null,null,null,"Year","Cal Year","Award","Granted","Price",{"$f":"EOYDate","v":"2016-12-31"},{"$f":"DATE(YEAR(I9)+1,MONTH(I9),DAY(I9))","v":"2017-12-31"},{"$f":"DATE(YEAR(J9)+1,MONTH(J9),DAY(J9))","v":"2018-12-31"},{"$f":"DATE(YEAR(K9)+1,MONTH(K9),DAY(K9))","v":"2019-12-31"},"2020-12-31","2021-12-31","2022-12-31","2023-12-31","2024-12-31","2025-12-31"]
[null,null,null,null,null,null,null,null,1,{"$f":"I10+1","v":2},{"$f":"J10+1","v":3},4,5,6,7,8,9,10]
{"$rows_left_out":265}
{"sheet":"Company Perspective","index":4,"n_rows":30,"n_cols":21,"rows_kept":30,"cut":false,"hidden":false,"merged":[]}
[]
[]
[]
[]
[]
[]
[null,null,null,null,null,null,null,null,null,null,null,null,null,null,null,null,null,null,null,null,"Future Appreciation"]
[]
[null,null,null,null,null,null,null,null,null,null,null,null,null,null,null,null,null,null,null,null,"Phantom Stock Pool"]
[null,null,null,null,null,null,null,null,null,null,null,null,null,null,null,null,null,null,null,null,"[Share of Future Appreciation]"]
{"$rows_left_out":21}
{"sheet":"Variables","index":5,"n_rows":39,"n_cols":29,"rows_kept":39,"cut":false,"hidden":true,"merged":[[15,22,15,23],[38,8,38,9]]}
["Variables"]
[]
[]
[]
[null,null,null,"Calc or Reference - Don’t Change","Red    "]
[null,null,null,"From Census Tab","Green   "]
[null,null,null,"Change on Variables Page","Black   ",null,null,null,null,null,null,null,null,"ValueCritList",null,"NumYrsList",null,"GrowRateMethod",null,"YrsToVest",null,"VestingPeriod",null,"PlanType",null,null,"YrToGraph",null,"BenefitPayments"]
[null,null,"Set in Valuation Tab",null,null,null,null,null,null,null,null,null,null,"Gross Revenue",null,3,null,"Single Rate",null,3,null,"Cliff Vesting",null,"Full Value",null,null,1,null,"Annual Benefit Payments"]
[null,null,null,"Specify Values or Use Formulas",{"$f":"'Valuation Method'!H10","v":"Formula Based"},"InputValueMethod",null,null,null,null,null,null,null,"Operating Income",null,{"$f":"P8+1","v":4},null,"Rate Table",null,{"$f":"T8+1","v":4},null,"Vesting Schedule",null,"Incremental Value",null,null,2,null,"Cumulative Benefit Payments"]
[null,null,null,"Measurement Criteria",{"$f":"'Valuation Method'!H14","v":"EBITDA"},"ValueCriteriaSelected",null,null,null,null,null,null,null,"EBITDA",null,{"$f":"P9+1","v":5},null,null,null,{"$f":"T9+1","v":5},null,null,null,null,null,null,3]
{"$rows_left_out":30}
{"sheet":"Calcs","index":6,"n_rows":19,"n_cols":31,"rows_kept":19,"cut":false,"hidden":true,"merged":[]}
[]
[]
[]
[]
[]
[null,null,null,null,null,null,null,null,{"$f":"SharesNumber","v":100000}]
[]
[null,"Year","Year",{"$f":"ValueCriteriaSelected","v":"EBITDA"},"Projected\nRates","Business \nValue","Appreciation","Phantom Stock Pool","Share\nPrice",null,"Year","Year",{"$f":"IF(InputValueMethod=\"Specify Values\",\"Business Value is Specified Below\",\"Projected \"&ValueCriteriaSelected&IF(DisplayNumber=2,\" ($ Thousands)\",IF(DisplayNumber=3,\" ($ Millions)\",\"($ Dollars)\")))","v":"Projected EBITDA ($ Thousands)"},{"$f":"\"Projected Business Value\"&IF(DisplayNumber=2,\" ($ Thousands)\",IF(DisplayNumber=3,\" ($ Millions)\",\"($ Dollars)\"))","v":"Projected Business Value ($ Thousands)"},{"$f":"\"Initial Business Value\"&IF(DisplayNumber=2,\" ($ Thousands)\",IF(DisplayNumber=3,\" ($ Millions)\",\"($ Dollars)\"))","v":"Initial Business Value ($ Thousands)"},{"$f":"\"Projected Appreciation\"&IF(DisplayNumber=2,\" ($ Thousands)\",IF(DisplayNumber=3,\" ($ Millions)\",\"($ Dollars)\"))","v":"Projected Appreciation ($ Thousands)"},{"$f":"\"Phantom Stock Pool\"&IF(DisplayNumber=2,\" ($ Thousands)\",IF(DisplayNumber=3,\" ($ Millions)\",\"($ Dollars)\"))","v":"Phantom Stock Pool ($ Thousands)"},{"$f":"\"Phantom Stock Pool\"&IF(DisplayNumber=2,\" ($ Thousands)\",IF(DisplayNumber=3,\" ($ Millions)\",\"($ Dollars)\"))","v":"Phantom Stock Pool ($ Thousands)"},null,null,"Earned","Vested","Salary","Bonus","Total Comp",null,{"$f":"U8&IF(DisplayNumber=2,\" ($ Thousands)\",IF(DisplayNumber=3,\" ($ Millions)\",\"($ Dollars)\"))","v":"Earned ($ Thousands)"},{"$f":"V8&IF(DisplayNumber=2,\" ($ Thousands)\",IF(DisplayNumber=3,\" ($ Millions)\",\"($ Dollars)\"))","v":"Vested ($ Thousands)"},{"$f":"W8&IF(DisplayNumber=2,\" ($ Thousands)\",IF(DisplayNumber=3,\" ($ Millions)\",\"($ Dollars)\"))","v":"Salary ($ Thousands)"},{"$f":"X8&IF(DisplayNumber=2,\" ($ Thousands)\",IF(DisplayNumber=3,\" ($ Millions)\",\"($ Dollars)\"))","v":"Bonus ($ Thousands)"},{"$f":"Y8&IF(DisplayNumber=2,\" ($ Thousands)\",IF(DisplayNumber=3,\" ($ Millions)\",\"($ Dollars)\"))","v":"Total Comp ($ Thousands)"}]
[null,null,{"$f":"StartingYear","v":2015},{"$f":"IF(InputValueMethod=\"Specify Values\",0,CurrentValueofMeasure)","v":500000},null,{"$f":"IF(InputValueMethod=\"Specify Values\",'Rate Table'!D7,D9*ValuationMultiple)","v":2500000},null,null,{"$f":"IF(SharesNumber=0,0,F9/SharesNumber)","v":25},null,{"$f":"StartingYear","v":2015},{"$f":"IF(InputValueMethod=\"Specify Values\",\"\",K9)","v":2015},{"$f":"IF(InputValueMethod=\"Specify Values\",\"\",D9/CHOOSE(DisplayNumber,1,1000,1000000))","v":500},{"$f":"F9/CHOOSE(DisplayNumber,1,1000,1000000)","v":2500},{"$f":"$F$9/CHOOSE(DisplayNumber,1,1000,1000000)","v":2500},null,null,{"$f":"Q9+O9","v":2500}]
[null,{"$f":"B9+1","v":1},{"$f":"C9+1","v":2016},{"$f":"D9*(1+E10)","v":665000},{"$f":"IF(InputValueMethod=\"Specify Values\",(F10-F9)/F9,IF(GrowRateSelected=\"Rate Table\",'Rate Table'!I8,SingleRate))","v":0.33},{"$f":"IF(InputValueMethod=\"Specify Values\",'Rate Table'!D8,D10*ValuationMultiple)","v":3325000},{"$f":"F10-$F$9","v":825000},{"$f":"G10*PoolPercent","v":165000},33.25,null,{"$f":"K9+1","v":2016},2016,665,3325,2500,{"$f":"G10/CHOOSE(DisplayNumber,1,1000,1000000)","v":825},{"$f":"H10/CHOOSE(DisplayNumber,1,1000,1000000)","v":165},{"$f":"Q10+O10","v":2665},null,null,{"$f":"'Participant Values'!I51+'Participant Values'!I75+'Participant Values'!I99+'Participant Values'!I123+'Participant Values'!I147+'Participant Values'!I171+'Participant Values'!I195+'Participant Values'!I219+'Participant Values'!I243+'Participant Values'!I267","v":107250},{"$f":"'Participant Values'!I52+'Participant Values'!I76+'Participant Values'!I100+'Participant Values'!I124+'Participant Values'!I148+'Participant Values'!I172+'Participant Values'!I196+'Participant Values'!I220+'Participant Values'!I244+'Participant Values'!I268","v":0},{"$f":"'Participant Values'!I54+'Participant Values'!I78+'Participant Values'!I102+'Participant Values'!I126+'Participant Values'!I150+'Participant Values'!I174+'Participant Values'!I198+'Participant Values'!I222+'Participant Values'!I246+'Participant Values'!I270","v":1075000},{"$f":"'Participant Values'!I55+'Participant Values'!I79+'Participant Values'!I103+'Participant Values'!I127+'Participant Values'!I151+'Participant Values'!I175+'Participant Values'!I199+'Participant Values'!I223+'Participant Values'!I247+'Participant Values'!I271","v":297500},{"$f":"'Participant Values'!I56+'Participant Values'!I80+'Participant Values'!I104+'Participant Values'!I128+'Participant Values'!I152+'Participant Values'!I176+'Participant Values'!I200+'Participant Values'!I224+'Participant Values'!I248+'Participant Values'!I272","v":1372500},null,{"$f":"U10/CHOOSE(DisplayNumber,1,1000,1000000)","v":107.25},{"$f":"V10/CHOOSE(DisplayNumber,1,1000,1000000)","v":0},{"$f":"W10/CHOOSE(DisplayNumber,1,1000,1000000)","v":1075},{"$f":"X10/CHOOSE(DisplayNumber,1,1000,1000000)","v":297.5},{"$f":"Y10/CHOOSE(DisplayNumber,1,1000,1000000)","v":1372.5}]
{"$rows_left_out":10}
{"sheet":"Rate Table","index":7,"n_rows":17,"n_cols":35,"rows_kept":17,"cut":false,"hidden":false,"merged":[[2,1,2,4],[4,1,5,4],[2,6,2,9],[7,24,7,35],[6,24,6,27],[6,28,6,31],[6,32,6,35],[4,6,5,9],[2,11,2,15],[4,11,5,15]]}
[]
[null,null,null,null,null,null,null,null,null,null,null,null,null,null,null,null,null,null,null,null,null,null,null,null,null,{"$f":"COUNTIF(Z11:AK11,\">0\")","v":2},"Vesting Years"]
[null,"Back to Valuation Method Exhibit",null,null,null,null,"Back to Valuation Method Exhibit",null,null,null,null,"Back to Valuation Method Exhibit",null,null,null,null,null,null,null,null,null,null,null,null,null,{"$f":"'Valuation Method'!H21","v":5},"Vesting Period"]
[null,null,null,null,null,null,null,null,null,null,null,null,null,null,null,null,null,null,null,null,null,null,null,null,null,{"$f":"'Valuation Method'!H22","v":"Vesting Schedule"},"Vesting Schedule"]
[null,"Specified Business Value",null,null,null,null,"Valuation Growth Rate",null,null,null,null,"Vesting Schedule"]
[]
[null,"Start Year",{"$f":"StartingYear","v":2015},null,null,null,"Start Year",{"$f":"'Valuation Method'!H6","v":2015},"Enter\nRate",null,null,null,"Grant\nYear","Annual","Cum",null,null,null,null,null,null,null,null,null,"Back to Valuation Method Exhibit"]
[null,1,{"$f":"IF(B8<=NumYrsSelected,C7+1,\"\")","v":2016},null,null,null,1,{"$f":"IF(G8<=NumYrsSelected,H7+1,\"\")","v":2016},0.33,null,null,null,1,0,{"$f":"SUM($N$8:N8)","v":0},null,null,null,null,null,null,null,null,null,"Vesting Table"]
[null,{"$f":"B8+1","v":2},{"$f":"IF(B9<=NumYrsSelected,C8+1,\"\")","v":2017},null,null,null,{"$f":"G8+1","v":2},{"$f":"IF(G9<=NumYrsSelected,H8+1,\"\")","v":2017},0.33,null,null,null,{"$f":"IF(L9<=NumYrsSelected,M8+1,\"\")","v":2},0,{"$f":"SUM($N$8:N9)","v":0},null,null,null,null,null,null,null,null,null,null,1,{"$f":"Z9+1","v":2},{"$f":"AA9+1","v":3},4,5,6,7,8,9,10]
[null,{"$f":"B9+1","v":3},2018,null,null,null,{"$f":"G9+1","v":3},2018,0.33,null,null,null,3,0,{"$f":"SUM($N$8:N10)","v":0},null,null,null,null,null,null,null,null,null,null,2015,{"$f":"Z10+1","v":2016},{"$f":"AA10+1","v":2017},2018,2019,2020,2021,2022,2023,2024]
{"$rows_left_out":7}