{"text_format":"1","workbook":"xlsx","n_sheets":8,"sheets":["Input","Current Plans","Inputs Allowed","Variables","Individual Calculations ","SS Benefits","Notes","Tables"],"not_rendered":{"charts":1,"images":1,"macros":1,"external_links":0,"defined_names":122,"comments":0,"pivot_tables":0},"unopened":[],"bounds":{"document_bytes":16777216,"sheet_cells":100000,"rows_first":2000,"rows_last":500,"rows_between":2000,"halvings":0,"cell_chars":16384,"cell_head_chars":4096},"cells_cut":0,"cells_raw":0,"read":"whole","date_system":"1900"}

{"sheet":"Input","index":0,"n_rows":58,"n_cols":55,"rows_kept":58,"cut":false,"hidden":false,"merged":[[0,64,0,67],[1,34,1,39],[0,6,0,32],[1,6,1,32],[6,13,6,15],[8,25,8,29],[17,34,17,38],[12,34,12,39],[5,25,5,29],[3,8,4,15],[9,13,9,15],[3,20,4,29],[13,6,13,39],[7,13,7,15],[7,25,7,29]]}
[]
[null,null,null,null,null,null,"INPUTS",null,null,null,null,null,null,null,null,null,null,null,null,null,null,null,null,null,null,null,null,null,null,null,null,null,null,null,"CLICK THE BUTTON"]
[]
[null,null,null,null,null,null,null,null,"Key Inputs",null,null,null,null,null,null,null,null,null,null,null,"Additional Inputs"]
[]
[null,null,null,null,null,null,null,null,"Age",null,null,null,null,null,null,null,null,null,null,null,"Start Year for Analysis",null,null,null,null,2012]
[null,null,null,null,null,null,null,null,"Target Retirement Income %",null,null,null,null,0.8]
[null,null,null,null,null,null,null,null,"% Target Savings",null,null,null,null,0.1,null,null,null,null,null,null,"Pre-Ret Investment Return"]
[null,null,null,null,null,null,null,null,"Saving for How Many Prior Yrs",null,null,null,null,null,null,null,null,null,null,null,"Post-Ret Investment Return"]
[null,null,null,null,null,null,null,null,"Compensation Growth Rate",null,null,null,null,0.05]
{"$rows_left_out":49}
{"sheet":"Current Plans","index":1,"n_rows":90,"n_cols":21,"rows_kept":90,"cut":false,"hidden":false,"merged":[[10,4,10,5],[10,7,10,13],[10,15,10,18],[11,0,11,1]]}
["Retirement Benefit using Current 403(b) Plan and 457(b) Plan"]
[{"$f":"\"Plan Participant - Age \"&Age","v":"Plan Participant - Age 40"}]
[null,null,null,null,null,null,null,null,null,null,null,"Pretax\nRetmnt\nIncome","% of\nFinal\nComp"]
[null,null,null,null,null,null,null,null,"Current Comp (Use Drop to Change)==>  ",null,null,{"$f":"-MIN(L13:L87)","v":120198.26337718034},{"$f":"L4/'Individual Calculations '!$BH$12","v":7.4539248689931795E-2},"  <==403(b)"]
[null,null,null,null,null,null,null,null,"Projected Final Comp==>  ",{"$f":"'Individual Calculations '!BH12","v":1612549.9718568511},null,{"$f":"-MIN(Q13:Q87)","v":83033.019101402257},{"$f":"L5/'Individual Calculations '!$BH$12","v":5.1491749434462331E-2},"  <==457(b)"]
[null,null,null,null,null,null,null,null,"Target Retirement %==>  ",{"$f":"RetIncTarget","v":0.8},null,{"$f":"'Individual Calculations '!BH6","v":99183.73866307702},{"$f":"L6/'Individual Calculations '!$BH$12","v":6.150738916256155E-2},"  <==Social Security"]
[null,null,null,null,null,null,null,null,"Target Retirement Income==>  ",{"$f":"J5*J6","v":1290039.977485481},null,{"$f":"SUM(L4:L6)","v":302415.02114165958},{"$f":"L7/'Individual Calculations '!$BH$12","v":0.18753838728695565},"  <==Projected Retirement Income"]
[null,null,null,null,null,null,null,null,null,"RETIREMENT GAP==>  ",{"$f":"MAX(0,RetIncTarget-M7)","v":0.61246161271304445}]
[]
[null,null,null,null,-1,{"$f":"E10-1","v":-2},null,{"$f":"F10-1","v":-3},{"$f":"H10-1","v":-4},-5,-6,-7,-8,-9,null,{"$f":"N10-1","v":-10},{"$f":"P10-1","v":-11},{"$f":"Q10-1","v":-12},{"$f":"R10-1","v":-13},null,{"$f":"S10-1","v":-14}]
{"$rows_left_out":81}
{"sheet":"Inputs Allowed","index":2,"n_rows":70,"n_cols":48,"rows_kept":70,"cut":false,"hidden":true,"merged":[]}
[{"$f":"VLOOKUP(AgeNum,$B$4:$C$29,2,FALSE)","v":40},"Age",null,null,{"$f":"E5","v":65},"RetAge",null,null,{"$f":"VLOOKUP(I3,J4:K5,2,FALSE)","v":"No"},"LeverageUse",null,null,{"$f":"VLOOKUP(PretaxATNum,$N$4:$O$5,2,FALSE)","v":"After Tax"},"PretaxATUse",null,null,null,null,null,{"$f":"VLOOKUP(StartYrNum,$U$4:$V$13,2,FALSE)","v":2014},"StartYr",null,null,25,"BenPmtsYears",null,null,{"$f":"VLOOKUP(AcctBalGrowthNum,$AC$4:$AD$6,2,FALSE)","v":0.06},"AcctBalGrowth",null,null,null,null,null,null,null,null,{"$f":"VLOOKUP(IncomeLevelNum,$AM$4:$AN$8,2,FALSE)","v":500000},"IncomeLevelExhibited",null,null,{"$f":"VLOOKUP(PriorYrsSavingNum,$AQ$4:$AR$8,2,FALSE)","v":0},"PriorYrsSaving",null,null,{"$f":"VLOOKUP(PostRetGrowthNum,$AU$4:$AV$6,2,FALSE)","v":0.04},"PostRetGrowth"]
[1,"AgeNum",null,null,2,"RetAgeNum",null,null,1,"LeverageUseNum",null,null,2,"PretaxATNum",null,null,null,null,null,1,"StartYrNum",null,null,2,"BenPmtsYearsNum",null,null,2,"AcctBalGrowthNum",null,null,null,null,null,null,null,null,4,"IncomeLevelNum",null,null,1,"PriorYrsSavingNum",null,null,2,"PostRetGrowthNum"]
[{"$f":"VLOOKUP(MAX(A4:A29),$A$4:$B$29,2,FALSE)","v":3},"AgeAllowed",null,null,2,"RetAgeAllowed",null,null,2,"LeverageAllowed",null,null,2,"PretaxATAllowed",null,null,{"$f":"VLOOKUP(100,Q4:R70,2,FALSE)","v":35},"DeathAgeAllow",null,{"$f":"VLOOKUP(2020,T4:U13,2,FALSE)","v":7},"StartYrAllowed",null,null,2,"BenPmtsAllowed",null,null,4,"InvRetAllowed",null,null,1,"ContribStratAllowed",null,1,29600,null,5,"IncomeLevelAllowed",null,null,5,"PriorYrsSavingAllowed",null,null,3,"PostRetInvRetAllowed"]
[40,1,40,null,60,1,{"$f":"E4","v":60},null,"Yes",1,{"$f":"I4","v":"Yes"},null,"Pretax",1,{"$f":"M4","v":"Pretax"},null,{"$f":"RetAge+1","v":66},1,null,2014,1,{"$f":"T4","v":2014},null,{"$f":"VLOOKUP(Age,#REF!,4,FALSE)","v":{"$error":"#REF!"}},1,{"$f":"X4","v":{"$error":"#REF!"}},null,0.05,1,{"$f":"AB4","v":0.05},null," % of Compensation",1,null,2,14800,null,50000,1,50000,null,0,1,{"$f":"AP4","v":0},null,0.03,1,{"$f":"AT4","v":0.03}]
[50,{"$f":"B4+1","v":2},50,null,65,{"$f":"F4+1","v":2},{"$f":"E5","v":65},null,"No",{"$f":"J4+1","v":2},{"$f":"I5","v":"No"},null,"After Tax",{"$f":"N4+1","v":2},{"$f":"M5","v":"After Tax"},null,{"$f":"Q4+1","v":67},{"$f":"R4+1","v":2},null,{"$f":"T4+1","v":2015},{"$f":"U4+1","v":2},{"$f":"T5","v":2015},null,{"$f":"VLOOKUP(Age,#REF!,6,FALSE)","v":{"$error":"#REF!"}},{"$f":"Y4+1","v":2},{"$f":"X5","v":{"$error":"#REF!"}},null,0.06,{"$f":"AC4+1","v":2},{"$f":"AB5","v":0.06},null," Flat Dollar Amount",{"$f":"AG4+1","v":2},null,3,69400,null,100000,{"$f":"AM4+1","v":2},100000,null,{"$f":"AP4+5","v":5},{"$f":"AQ4+1","v":2},{"$f":"AP5","v":5},null,0.04,{"$f":"AU4+1","v":2},{"$f":"AT5","v":0.04}]
[60,{"$f":"B5+1","v":3},60,null,null,null,null,null,null,null,null,null,null,null,null,null,68,3,null,2016,3,2016,null,null,null,null,null,7.0000000000000007E-2,{"$f":"AC5+1","v":3},{"$f":"AB6","v":7.0000000000000007E-2},null," Maximize IRS Limits",{"$f":"AG5+1","v":3},null,4,113800,null,250000,{"$f":"AM5+1","v":3},250000,null,{"$f":"AP5+5","v":10},{"$f":"AQ5+1","v":3},{"$f":"AP6","v":10},null,0.05,{"$f":"AU5+1","v":3},{"$f":"AT6","v":0.05}]
[null,null,null,null,null,null,null,null,null,null,null,null,null,null,null,null,69,4,null,2017,4,2017,null,null,null,null,null,0.08,{"$f":"AC6+1","v":4},{"$f":"AB7","v":0.08},null,null,null,null,5,24700,null,500000,{"$f":"AM6+1","v":4},500000,null,{"$f":"AP6+5","v":15},{"$f":"AQ6+1","v":4},{"$f":"AP7","v":15}]
[null,null,null,null,null,null,null,null,null,null,null,null,null,null,null,null,70,5,null,2018,5,2018,null,null,null,null,null,null,null,null,null,null,null,null,6,138500,null,750000,{"$f":"AM7+1","v":5},750000,null,{"$f":"AP7+5","v":20},{"$f":"AQ7+1","v":5},{"$f":"AP8","v":20}]
[null,null,null,null,null,null,null,null,null,null,null,null,null,null,null,null,71,6,null,2019,6,2019]
[null,null,null,null,null,null,null,null,null,null,null,null,null,null,null,null,72,7,null,2020,7,2020]
{"$rows_left_out":61}
{"sheet":"Variables","index":3,"n_rows":48,"n_cols":14,"rows_kept":48,"cut":false,"hidden":true,"merged":[[19,1,19,5],[21,1,21,5],[7,8,7,10],[9,13,9,15],[8,13,8,15],[10,13,10,17],[11,13,11,17],[12,13,12,17],[13,13,13,17]]}
[null,"Switches",null,null,null,null,1,"ESP - Var Prem","45 - Lincoln - Taxes - PSP Contributions tax at a flat rate - 40%"]
[null,"First Illustration to Use (without SD)",1,"IllusUsed",null,null,2,"SD - Var Prem","45 - Lincoln - Taxes -ESD Contributions = Plan "]
[null,"Second Illustration to Use (with SD)",2,"IllusUsed2",null,null,3,"ESP - Lvl Prem","45 - Lincoln - PSP Contributions 30k"]
[null,"Select Tax Table",1,"TaxRates, 1=Flat,2=Fluctuating",null,null,4,"SD - Lvl Prem","45 - Lincoln - Taxes -ESD Contributions = Plan based on 30k"]
[null,"Social Security Growth Rate",0.03,"SSBenGrowth"]
[null,"IRS Comp Limit Growth Rate",0.03,"IRSCompLimitGrowth"]
[null,"Section 415 Limit Index Growth",0.03,"Section415LimitGrowth",null,null,null,null,"Inputs Not Needed"]
[null,"IRS Comp Limit Index Growth",0.03,"IRS401kLimitGrowth",null,null,null,null,null,null,null,"Bonus"]
[null,"Funding - Life Insurance Information/Data",null,null,null,null,null,null,"First Name"]
[null,"Crediting Rate",7.0000000000000007E-2,"PolicyRate",null,null,null,null,"Last Name"]
{"$rows_left_out":39}
{"sheet":"Individual Calculations ","index":4,"n_rows":88,"n_cols":67,"rows_kept":88,"cut":false,"hidden":true,"merged":[[8,4,8,6],[8,17,8,24],[8,8,8,15],[8,26,8,31],[8,33,8,38],[8,41,8,46],[8,49,8,54],[10,8,10,13],[10,18,10,21],[10,23,10,24]]}
[null,{"$f":"Age","v":40},"Current Age",null,{"$f":"Salary","v":500000},"Current Salary"]
[null,{"$f":"PriorYrsSaving","v":0},"Prior Yrs Saving",null,{"$f":"CompGrowthRate","v":0.05},"Growth Rate",null,null,null,null,null,null,null,null,null,null,null,null,null,null,null,null,null,null,null,null,null,null,"Balance at Retirement",{"$f":"INDEX(AF13:AF88,RetAge-1-Age+1+PriorYrsSaving)","v":1562285.4037991755},null,null,null,null,null,"Balance at Retirement",{"$f":"INDEX(AM13:AM88,RetAge-1-Age+1+PriorYrsSaving)","v":390571.35094979388},null,null,null,null,null,null,"Balance at Retirement",{"$f":"INDEX(AU13:AU88,RetAge-1-Age+1+PriorYrsSaving)","v":1349034.4008593899},null,null,null,null,null,null,"Balance at Retirement",{"$f":"INDEX(BC13:BC88,RetAge-1-Age+1+PriorYrsSaving)","v":842570.12390395696}]
[null,{"$f":"B1-B2","v":40},"Age Started Saving",null,{"$f":"IF(B20=0,E1,E1/((1+E2)^B2))","v":500000},"Salary When Started",null,null,null,null,null,null,null,null,null,null,null,null,null,null,null,null,null,null,null,null,null,null,"Years for Ret. Benefit",{"$f":"RetDistYrs","v":25},null,null,null,null,null,"Years for Ret. Benefit",{"$f":"RetDistYrs","v":25},null,null,null,null,null,null,"Years for Ret. Benefit",{"$f":"RetDistYrs","v":25},null,null,null,null,null,null,"Years for Ret. Benefit",{"$f":"RetDistYrs","v":25}]
[null,{"$f":"StartYr-B2","v":2014},"Year",null,null,null,null,null,null,null,null,null,null,null,null,null,null,null,null,null,null,null,null,null,null,null,null,null,"Annual Ret. Benefit",{"$f":"PMT(PostRetGrowth,AD3,AD2,,1)","v":-96158.61070174427},"AnnRet403b",null,null,null,null,"Annual Ret. Benefit",{"$f":"PMT(PostRetGrowth,AK3,AK2,,1)","v":-24039.652675436068},"AnnRet403bERMatch",null,null,null,null,null,"Annual Ret. Benefit",{"$f":"PMT(PostRetGrowth,AS3,AS2,,1)","v":-83033.019101402257},"AnnRet457b",null,null,null,null,null,"Annual Ret. Benefit",{"$f":"PMT(AcctBalGrowth*(1-EEBlendedTaxRate),BA3,BA2,,1)","v":-52860.556858419419},"AnnRetATSavingsAT",null,null,null,null,null,{"$f":"IncomeLevelExhibited","v":500000},"Salary"]
[null,null,null,null,null,null,null,null,null,null,null,null,null,null,null,null,null,null,null,null,null,null,null,null,null,null,null,null,"Avg Annual AT",{"$f":"SUM(AD13:AD88)/AD3","v":-52887.235885959351},"AnnRet403bAT",null,null,null,null,"Avg Annual AT",{"$f":"SUM(AK13:AK88)/AK3","v":-13221.808971489838},"AnnRet403bERMatchAT",null,null,null,null,null,"Avg Annual AT",{"$f":"SUM(AS13:AS88)/AS3","v":-45668.160505771259},"AnnRet457bAT",null,null,null,null,null,null,null,null,null,null,null,null,null,{"$f":"VLOOKUP(Salary,$BG$21:$BH$25,2,FALSE)","v":6.150738916256155E-2},"Social Security Displayed"]
[null,null,null,null,null,"Final Income==>",{"$f":"VLOOKUP(RetAge-1,$C$13:$G$88,5,FALSE)","v":1612549.9718568511},null,null,null,null,null,null,null,null,null,null,null,null,null,null,null,null,null,null,null,null,null,null,null,null,null,null,null,null,null,null,null,null,null,null,{"$f":"IF(MAX(AO13:AO88)=0,AP13,VLOOKUP(MAX(AO13:AO88),AO13:AP88,2,FALSE))","v":17500},"<==Minimum Contribution",null,null,null,null,null,null,{"$f":"IF(MAX(AW13:AW88)=0,AX13,VLOOKUP(MAX(AW13:AW88),AW13:AX88,2,FALSE))","v":15000},"<==Minimum Contribution",null,null,null,null,null,null,null,null,{"$f":"BH5*BH12","v":99183.73866307702},"Social Security Benefit"]
[null,null,null,null,null,null,null,null,null,null,null,null,null,null,null,null,null,null,null,null,null,null,null,null,null,null,{"$f":"SUM(AA13:AA88)/(RetAge-Age)","v":30700},"<==Average Contrib over Working Career",null,null,null,null,null,{"$f":"SUM(AH13:AH88)/(RetAge-Age)","v":7675},"<==Average Contrib over Working Career",null,null,null,null,null,null,{"$f":"SUM(AP13:AP88)/(RetAge-Age)","v":25340},"<==Average Contrib over Working Career",null,null,null,null,null,null,{"$f":"SUM(AX13:AX88)/(RetAge-Age)","v":39414.197635975426},"<==Average Contrib over Working Career"]
[null,null,null,null,-1,{"$f":"E8+-1","v":-2},{"$f":"F8+-1","v":-3},null,{"$f":"G8-1","v":-4},{"$f":"I8+-1","v":-5},-6,-7,-8,-9,-10,-11,null,{"$f":"P8-1","v":-12},{"$f":"R8-1","v":-13},{"$f":"S8-1","v":-14},-15,-16,-17,-18,-19,null,{"$f":"Y8-1","v":-20},{"$f":"AA8-1","v":-21},{"$f":"AB8-1","v":-22},{"$f":"AC8-1","v":-23},{"$f":"AD8-1","v":-24},{"$f":"AE8-1","v":-25},null,{"$f":"AF8-1","v":-26},{"$f":"AH8-1","v":-27},{"$f":"AI8-1","v":-28},{"$f":"AJ8-1","v":-29},{"$f":"AK8-1","v":-30},{"$f":"AL8-1","v":-31},null,null,{"$f":"AM8-1","v":-32},{"$f":"AP8-1","v":-33},{"$f":"AQ8-1","v":-34},{"$f":"AR8-1","v":-35},{"$f":"AS8-1","v":-36},{"$f":"AT8-1","v":-37},null,null,{"$f":"AU8-1","v":-38},{"$f":"AX8-1","v":-39},{"$f":"AY8-1","v":-40},{"$f":"AZ8-1","v":-41},{"$f":"BA8-1","v":-42},{"$f":"BB8-1","v":-43}]
[null,null,null,null,"Compensation",null,null,null,"Maximum Allowable Contributions",null,null,null,null,null,null,null,null,"Contribution based on Target %",null,null,null,null,null,null,null,null,"403(b) - Executive Contributions Including Catch-Up",null,null,null,null,null,null,"403(b) - Employer Match",null,null,null,null,null,null,null,"457(b) - Executive Contributions",null,null,null,null,null,null,null,"Excluded Contributions - After Tax Savings"]
[null,null,null,null,null,null,null,null,null,null,null,null,null,null,null,null,null,null,null,null,null,null,null,null,null,null,null,null,null,null,null,null,null,null,null,null,null,null,null,null,null,null,null,null,null,null,null,null,null,null,null,null,null,null,null,null,null,null,null,"Final","Pretax","Pretax","Pretax","AT Savings"]
{"$rows_left_out":79}
{"sheet":"SS Benefits","index":5,"n_rows":33,"n_cols":15,"rows_kept":33,"cut":false,"hidden":true,"merged":[]}
[]
[]
[]
[]
[null,null,null,null,null,null,null,50000,100000,250000,500000,750000]
[null,null,null,null,null,null,"Projected Monthly Benefit"]
[null,null,null,null,null,null,40,3894,5654,6243,6243,6243]
[null,null,null,null,null,null,50,2491,3693,4228,4228,4228]
[null,null,null,null,null,null,60,1573,2351,2877,2877,2877]
[]
{"$rows_left_out":24}
{"sheet":"Notes","index":6,"n_rows":30,"n_cols":3,"rows_kept":30,"cut":false,"hidden":true,"merged":[]}
["Notes"]
[null,"Development Notes"]
[null,"Input Screen - add the ability to specify the Employer Match %"]
[]
[null,"PSP Amount - on the Contribution to PSP - perhaps don't redirect it?  Just allow them to specify amount to contribute - then provide the following feedback:"]
[null,"      How much does that add to the retirement income?"]
[null,"      How does it compare to the alternatives?"]
[null,"      Allow them to specify the contribution as a pretax target or an after tax amount?"]
[]
[null,"403(b) Plans"]
{"$rows_left_out":21}
{"sheet":"Tables","index":7,"n_rows":131,"n_cols":30,"rows_kept":131,"cut":false,"hidden":true,"merged":[[3,18,3,19],[6,18,6,19],[51,25,51,26],[6,16,6,17],[3,2,3,5],[3,6,3,9],[3,10,3,13],[3,16,3,17],[3,14,3,15]]}
["Col#"]
[{"$f":"COLUMN()","v":1},{"$f":"COLUMN()","v":2},{"$f":"COLUMN()","v":3},{"$f":"COLUMN()","v":4},{"$f":"COLUMN()","v":5},{"$f":"COLUMN()","v":6},{"$f":"COLUMN()","v":7},{"$f":"COLUMN()","v":8},{"$f":"COLUMN()","v":9},{"$f":"COLUMN()","v":10},{"$f":"COLUMN()","v":11},{"$f":"COLUMN()","v":12},{"$f":"COLUMN()","v":13},{"$f":"COLUMN()","v":14},{"$f":"COLUMN()","v":15},{"$f":"COLUMN()","v":16},{"$f":"COLUMN()","v":17},{"$f":"COLUMN()","v":18},{"$f":"COLUMN()","v":19},{"$f":"COLUMN()","v":20},{"$f":"COLUMN()","v":21},{"$f":"COLUMN()","v":22},{"$f":"COLUMN()","v":23}]
["Rounding Rule ==>",null,null,null,null,null,null,5000,null,null,null,5000,null,null,null,1000,null,500,null,500]
[null,null,"SSBenGrowth",null,null,null,"Section415LimitGrowth",null,null,null,"IRSCompLimitGrowth",null,null,null,"Defined Contrib Plan Limit",null,"Annual Contrib",null,"Age 50+ Catch-up Contrib"]
[null,null,{"$f":"SSBenGrowth","v":0.03},null,null,null,{"$f":"Section415LimitGrowth","v":0.03},null,null,null,{"$f":"IRSCompLimitGrowth","v":0.03},null,null,null,{"$f":"IRS401kLimitGrowth","v":0.03},null,{"$f":"IRS401kLimitGrowth","v":0.03}]
[null,{"$f":"COUNTBLANK(B10:B126)","v":44},null,null,null,null,null,null,null,null,null,null,null,null,null,null,null,null,null,null,"35 Yr Avg"]
[null,null,"Social",null,"3 Yr Avg","5 Yr Avg","Section",null,"3 Yr Avg","5 Yr Avg","IRS",null,"3 Yr Avg","5 Yr Avg","Defined","Defined","IRS 401(k), 403(b) & 457(b) (402(g)(1))",null,"Age 50+ Catch-up","Age 50+","Social","4 Yr Avg","4 Yr Avg"]
[null,null,"Security","With","Soc Security","Soc Security","415 Limit","Section","Section","Section","Comp Limit","IRS","IRS","IRS","Contrib Plan","Contrib Plan","Contrib Limit",null,"Deferrals","Catch-up","Security","Section","IRS"]
["Year","Age","Wage Base","Rounding","Wage Base","Wage Base","Index","415 Limit","415 Limit","415 Limit","Index","Comp Limit","Comp Limit","Comp Limit","Limit Index","Limit","Index","Contrib Limit","Index","Deferrals","Wage Base","415 Limit","Comp Limit"]
[1970,{"$f":"IF(A10<StartYr,\"\",IF(A10=StartYr,Age,B9+1))","v":""},7800,{"$f":"INT(C10/100)*100","v":7800}]
{"$rows_left_out":121}